{"text_format":"1","workbook":"xlsx","n_sheets":6,"sheets":["Readme","Case 1","Case 2","Case 3","Case 4","MC_Simu"],"not_rendered":{"charts":162,"images":4,"macros":1,"external_links":5,"defined_names":90,"comments":0,"pivot_tables":0},"unopened":[],"bounds":{"document_bytes":16777216,"sheet_cells":100000,"rows_first":2000,"rows_last":500,"rows_between":2000,"halvings":0,"cell_chars":16384,"cell_head_chars":4096},"cells_cut":0,"cells_raw":0,"read":"whole","date_system":"1900"}

{"sheet":"Readme","index":0,"n_rows":8,"n_cols":3,"rows_kept":8,"cut":false,"hidden":false,"merged":[]}
["Teamer VT Project Plots"]
[]
["Created by",null,"Mirko Previsic"]
["Company",null,"RE Vision Consulting, LLC"]
["Contact",null,"mirko@re-vision.net"]
["Date",null,"2023-05-20"]
[]
["Disclaimer"]

{"sheet":"Case 1","index":1,"n_rows":355,"n_cols":21,"rows_kept":355,"cut":false,"hidden":false,"merged":[]}
[]
["CAPEX"]
[null,null,null,null,"Cost",null,null,"Economics",null,null,"Uncertainty",null,"Multiplier"]
[null,null,null,null,"$/Farm","$/WEC","$/kW","$/MWh","in %","in % Total"," +%"," -%","MC"]
[null,null,1.1000000000000001,"Marine Energy Converter (MEC)",334334077.42011333,1255187.0487004276,3343.3407742011332,95.438135943902552,0.63900183605434546,0.44284553302510282]
[null,null,"1.1.1","Structural Assembly",111700291.71797511,419355.27656154917,1117.0029171797512,31.885674676703935,0.21348913053186158,0.14795373420086289,0.5,-0.5,1]
[null,null,"1.1.2","Power Take-Off System (PTO)",141191435.62387556,530073.5801448616,1411.9143562387555,40.304139892547944,0.26985459362981984,0.18701652266474331,0.5,-0.5,1]
[null,null,"1.1.3","Mooring, Foundation, and Sub-Structure ",81442350.078262642,305758.19199401693,814.42350078262632,23.248321374650672,0.15565811189266404,0.10787527615949662,0.5,-0.5,1]
[null,null,1.2,"Balance of System (BOS)",141314118.30130213,530534.16648112144,1413.1411830130214,40.339160570477489,0.27008907303656349,0.30036889665508337]
[null,null,"1.2.1","Project Development",14857203.858714079,55778.250327521193,148.57203858714078,4.2410987613221547,2.839608997566356E-2,1.9679257384844242E-2,1,-0.5,1]
[null,null,"1.2.2","Engineering and Management",9326435.2102238331,35014.141474148018,93.264352102238334,2.6622999316545104,1.7825311942958999E-2,1.2353422671616637E-2,1,-0.5,1]
[null,null,"1.2.3","Electrical Infrastructure",31675779.831304844,118920.06016419367,316.75779831304845,9.0420857036074676,6.0540886609123518E-2,4.1956469743147137E-2,1,-0.5,1]
[null,null,"1.2.6","Assembly & Installation",85454699.401059389,320821.71451525856,854.54699401059395,24.393676173893354,0.16332678450881744,0.11318987342773769,1,-0.5,1]
[null,null,"1.2.6.1","Device",66835431.556931607,250919.58537971516,668.3543155693161,19.078668414600859,0.12774038413289954,8.852753671173208E-2,1,-0.5,1]
[null,null,"1.2.6.2","Subsea Cables",18619267.844127785,69902.129135543422,186.19267844127788,5.3150077592924987,3.5586400375917919E-2,2.4662336716005623E-2,1,-0.5,1]
[null,null,1.3,"Financial Costs ",47564819.57214155,178572.12151815492,475.6481957214155,13.577729651438004,9.0909090909090912E-2,6.3002455625244841E-2]
[null,null,"1.3.2","Insurance During Construction",9512963.9144283105,35714.424303630985,95.129639144283104,2.7155459302876008,1.8181818181818181E-2,1.260049112504897E-2,0.5,-0.3,1]
[null,null,"1.3.3","Construction Financing Costs",38051855.657713242,142857.69721452394,380.51855657713241,10.862183721150403,7.2727272727272724E-2,5.0401964500195878E-2,0.5,-0.3,1]
[]
[null,null,"Total CAPEX",null,797546652.56806028,2994221.3392142388,5232.1301529355705,149.35502616581806,0.99999999999999989,0.80621688530543101]
[]
["OPEX"]
[null,null,null,null,"Cost",null,null,"Economics",null,null,"Uncertainty",null,"Multiplier"]
[null,null,null,null,"$/Farm","$/WEC","$/kW","$/MWh","in %",null," +%"," -%","MC"]
[null,null,2.1,"Operations",8096466.5256806025,30396.482469541599,53.531301529355709,33.017089583217647,0.49907859797752635,0.15320364852905261]
[null,null,"2.1.1","Environmental Monitoring",121000,454.26907739921251,1.21,0.49343350298524269,7.458625335353233E-3,2.289596506478123E-3,1,-0.5,1]
[null,null,"2.1.3","Insurance",7975466.5256806025,29942.213392142388,52.321301529355708,32.523656080232406,0.49161997264217311,0.15091405202257449,1,-0.5,1]
[null,null,2.2000000000000002,"Maintenance",8126362.0197445955,30508.718820837836,81.26362019744596,33.13900229693229,0.50092140202247359,0.15376933959325392,1,-0.5,1]
[]
[null,null,"Total OPEX",null,16222828.545425199,60905.201290379438,134.79492172680168,66.156091880149944,1,0.30697298812230656]
[]
[null,null,"$/MWh",null,null,null,null,215.511118045968]
[]
[null,null,"Technology LCoE",null,464836157.09461164,1745129.687811278,4620.9282072186661,193.7571923871061,1.8501926857609825,0.89905891697790807]
[]
["Tables for Plots"]
[null,null,null,"LCOE Table","%","LCoE",null,null,"CAPEX","%"]
[null,null,null,"Structural Assembly",0.14795373420086291,31.885674676703935,null,null,"Structural Assembly",0.21348913053186164]
[null,null,null,"Power Take-Off System (PTO)",0.18701652266474333,40.304139892547944,null,null,"Power Take-Off System (PTO)",0.26985459362981989]
[null,null,null,"Mooring, Foundation, and Sub-Structure ",0.10787527615949663,23.248321374650672,null,null,"Mooring, Foundation, and Sub-Structure ",0.15565811189266407]
{"$rows_left_out":316}
{"sheet":"Case 2","index":2,"n_rows":350,"n_cols":21,"rows_kept":350,"cut":false,"hidden":false,"merged":[]}
[]
["CAPEX"]
[null,null,null,null,"Cost",null,null,"Economics",null,null,"Uncertainty",null,"Multiplier"]
[null,null,null,null,"$/Farm","$/WEC","$/kW","$/MWh","in %","in % Total"," +%"," -%","MC"]
[null,null,1.1000000000000001,"Marine Energy Converter (MEC)",346782971.82966411,355220.13530318567,3467.8297182966412,99.050392887975846,0.61195181313378544,0.42232770084102844]
[null,null,"1.1.1","Structural Assembly",105777261.58316211,108350.80215538191,1057.7726158316211,30.212784852575531,0.18666022346085007,0.12882024584419219,0.5,-0.5,1]
[null,null,"1.1.2","Power Take-Off System (PTO)",125614691.10529864,128670.87254909774,1256.1469110529865,35.878879637126524,0.22166641450862717,0.15297914833146595,0.5,-0.5,1]
[null,null,"1.1.3","Mooring, Foundation, and Sub-Structure ",115391019.14120333,118198.46059870603,1153.9101914120333,32.958728398273792,0.20362517516430823,0.14052830666537028,0.5,-0.5,1]
[null,null,1.2,"Balance of System (BOS)",168383811.48854244,172480.5574629131,1683.8381148854241,48.094872121077707,0.29713909595712362,0.33625887861440923]
[null,null,"1.2.1","Project Development",19139660.991593223,19605.325288089232,191.39660991593223,5.4667936287574275,3.3774871311514486E-2,2.3309128988682482E-2,1,-0.5,1]
[null,null,"1.2.2","Engineering and Management",10101309.476827579,10347.072407178408,101.01309476827579,2.8852012746873248,1.7825311942959002E-2,1.2301823196000884E-2,1,-0.5,1]
[null,null,"1.2.3","Electrical Infrastructure",31416766.754547358,32181.130689486508,314.16766754547359,8.9734598959383618,5.543970996271945E-2,3.8260733510940725E-2,1,-0.5,1]
[null,null,"1.2.6","Assembly & Installation",107726074.26557426,110347.02907815894,1077.2607426557427,30.769417321694593,0.19009920273993069,0.13119359645939258,1,-0.5,1]
[null,null,"1.2.6.1","Device",48404066.251413397,49581.727938755248,484.040662514134,13.825482128727719,8.5416408854555245E-2,5.8948621102876124E-2,1,-0.5,1]
[null,null,"1.2.6.2","Subsea Cables",59322008.014160857,60765.301139403688,593.22008014160861,16.943935192966872,0.10468279388537545,7.224497535651643E-2,1,-0.5,1]
[null,null,1.3,"Financial Costs ",51516678.331820659,52770.069276609873,515.16678331820651,14.714526500905354,9.0909090909090912E-2,6.2739298299604493E-2]
[null,null,"1.3.2","Insurance During Construction",10303335.666364131,10554.013855321975,103.0333566636413,2.9429053001810708,1.8181818181818181E-2,1.2547859659920899E-2,0.5,-0.3,1]
[null,null,"1.3.3","Construction Financing Costs",41213342.665456526,42216.0554212879,412.1334266545652,11.771621200724283,7.2727272727272724E-2,5.0191438639683596E-2,0.5,-0.3,1]
[]
[null,null,"Total CAPEX",null,894310025.73596442,916068.41786039073,5666.8346165002722,161.85979150995891,1,0.82132587775504207]
[]
["OPEX"]
[null,null,null,null,"Cost",null,null,"Economics",null,null,"Uncertainty",null,"Multiplier"]
[null,null,null,null,"$/Farm","$/WEC","$/kW","$/MWh","in %",null," +%"," -%","MC"]
[null,null,2.1,"Operations",9064100.2573596444,9284.6280854944616,57.878346165002725,36.984955375509799,0.50891134176572306,0.15769519649571465]
[null,null,"2.1.1","Environmental Monitoring",121000,123.94390689055392,1.21,0.49372573927600139,6.79364422339147E-3,2.1051310371913035E-3,1,-0.5,1]
[null,null,"2.1.3","Insurance",8943100.2573596444,9160.6841786039076,56.668346165002724,36.491229636233797,0.5021176975423316,0.15559006545852333,1,-0.5,1]
[null,null,2.2000000000000002,"Maintenance",8746664.6312961429,8959.4693112749592,87.46664631296143,35.689698027156538,0.49108865823427689,0.15217252220863581,1,-0.5,1]
[]
[null,null,"Total OPEX",null,17810764.888655789,18244.097396769423,145.34499247796415,72.674653402666337,1,0.30986771870435048]
[]
[null,null,"$/MWh",null,null,null,null,234.53444491262525]
[]
[null,null,"Technology LCoE",null,464393481.30155396,475692.08600842964,4611.1721566069455,199.77132918099926,1.7814836686740401,0.85177820791066816]
[]
["Tables for Plots"]
[null,null,null,"LCOE Table","%","LCoE",null,null,"CAPEX","%"]
[null,null,null,"Structural Assembly",0.12882024584419219,30.212784852575531,null,null,"Structural Assembly",0.18666022346085007]
[null,null,null,"Power Take-Off System (PTO)",0.15297914833146595,35.878879637126524,null,null,"Power Take-Off System (PTO)",0.22166641450862715]
[null,null,null,"Mooring, Foundation, and Sub-Structure ",0.14052830666537028,32.958728398273792,null,null,"Mooring, Foundation, and Sub-Structure ",0.2036251751643082]
{"$rows_left_out":311}
{"sheet":"Case 3","index":3,"n_rows":341,"n_cols":21,"rows_kept":341,"cut":false,"hidden":false,"merged":[]}
[]
["CAPEX"]
[null,null,null,null,"Cost",null,null,"Economics",null,null,"Uncertainty",null,"Multiplier"]
[null,null,null,null,"$/Farm","$/WEC","$/kW","$/MWh","in %","in % Total"," +%"," -%","MC"]
[null,null,1.1000000000000001,"Marine Energy Converter (MEC)",198517098.17214012,830730.64783096826,1985.1709817214009,56.746212541096753,0.62821615445170786,0.43764427189842675]
[null,null,"1.1.1","Structural Assembly",25892251.459207859,108350.80215538191,258.92251459207858,7.4013131261755047,8.1937177157886482E-2,5.7081206818014422E-2,0.5,-0.5,1]
[null,null,"1.1.2","Power Take-Off System (PTO)",142577324.24768081,596640.56158818188,1425.773242476808,40.755799977914521,0.45119226089645936,0.31432128433337703,0.5,-0.5,1]
[null,null,"1.1.3","Mooring, Foundation, and Sub-Structure ",30047522.465251438,125739.28408740455,300.47522465251438,8.5890994370067268,9.508671639736202E-2,6.6241780747035295E-2,0.5,-0.5,1]
[null,null,1.2,"Balance of System (BOS)",88756777.178789198,371418.76283718593,887.56777178789207,25.371169479230158,0.28087475463920114,0.27693340974178871]
[null,null,"1.2.1","Project Development",14546076.020928025,60870.68200939431,145.46076020928024,4.1580031600440464,4.6031702177641666E-2,3.2067801251245656E-2,1,-0.5,1]
[null,null,"1.2.2","Engineering and Management",5632821.0853123404,23571.557071924592,56.328210853123394,1.6101447454966058,1.7825311942958999E-2,1.2417932285500165E-2,1,-0.5,1]
[null,null,"1.2.3","Electrical Infrastructure",31716614.427700669,132723.90082833928,317.16614427700671,9.0662102154931734,0.10036863187834935,6.9921406045628964E-2,1,-0.5,1]
[null,null,"1.2.6","Assembly & Installation",36861265.644848168,154252.62292752776,368.61265644848169,10.536811358196331,0.11664910864025113,8.1263135079706963E-2,1,-0.5,1]
[null,null,"1.2.6.1","Device",19812750.160153128,82910.031062336959,198.12750160153129,5.6634846165078709,6.2698325883904282E-2,4.3678538009994619E-2,1,-0.5,1]
[null,null,"1.2.6.2","Subsea Cables",17048515.48469504,71342.5918651908,170.48515484695039,4.8733267416884614,5.3950782756346863E-2,3.7584597069712344E-2,1,-0.5,1]
[null,null,1.3,"Financial Costs ",28727387.535092935,120214.94106681545,287.27387535092936,8.2117382020326914,9.0909090909090925E-2,6.3331454656050862E-2]
[null,null,"1.3.2","Insurance During Construction",5745477.5070185866,24042.988213363089,57.454775070185867,1.6423476404065385,1.8181818181818184E-2,1.2666290931210172E-2,0.5,-0.3,1]
[null,null,"1.3.3","Construction Financing Costs",22981910.028074346,96171.952853452356,229.81910028074347,6.5693905616261539,7.2727272727272738E-2,5.0665163724840687E-2,0.5,-0.3,1]
[]
[null,null,"Total CAPEX",null,470346693.24475259,1968250.6785664989,3160.0126288602223,90.329120222359606,0.99999999999999989,0.77790913629626623]
[]
["OPEX"]
[null,null,null,null,"Cost",null,null,"Economics",null,null,"Uncertainty",null,"Multiplier"]
[null,null,null,null,"$/Farm","$/WEC","$/kW","$/MWh","in %",null," +%"," -%","MC"]
[null,null,2.1,"Operations",4824466.9324475257,20188.853137254235,32.81012628860222,19.701090051250613,0.5008698617582461,0.15194087543447304]
[null,null,"2.1.1","Environmental Monitoring",121000,506.34635158924527,1.21,0.49411301384792994,1.2562062114083518E-2,3.8107517752731961E-3,1,-0.5,1]
[null,null,"2.1.3","Insurance",4703466.9324475257,19682.506785664991,31.600126288602223,19.206977037402684,0.4883077996441626,0.14813012365919984,1,-0.5,1]
[null,null,2.2000000000000002,"Maintenance",4807709.6084044008,20118.729088563035,48.077096084044008,19.632660200945036,0.4991301382417539,0.15141312334896753,1,-0.5,1]
[]
[null,null,"Total OPEX",null,9632176.5408519264,40307.58222581727,80.887222372646221,39.333750252195649,1,0.3033539987834406]
[]
[null,null,"$/MWh",null,null,null,null,129.66287047455526]
[]
[null,null,"Technology LCoE",null,256568412.40823811,1073656.8558343486,2550.2495810465075,109.46107259798504,1.7692615091306196,0.84419751157263956]
[]
["Tables for Plots"]
[null,null,null,"LCOE Table","%","LCoE",null,null,"CAPEX","%"]
[null,null,null,"Structural Assembly",5.7081206818014422E-2,7.4013131261755047,null,null,"Structural Assembly",8.1937177157886482E-2]
[null,null,null,"Power Take-Off System (PTO)",0.31432128433337703,40.755799977914521,null,null,"Power Take-Off System (PTO)",0.45119226089645947]
[null,null,null,"Mooring, Foundation, and Sub-Structure ",6.6241780747035295E-2,8.5890994370067268,null,null,"Mooring, Foundation, and Sub-Structure ",9.5086716397362034E-2]
{"$rows_left_out":302}
{"sheet":"Case 4","index":4,"n_rows":343,"n_cols":21,"rows_kept":343,"cut":false,"hidden":false,"merged":[]}
["I/O - Screen"]
[]
[]
["CAPEX"]
[null,null,null,null,"Cost",null,null,"Economics",null,null,"Uncertainty",null,"Multiplier"]
[null,null,null,null,"$/Farm","$/WEC","$/kW","$/MWh","in %","in % Total"," +%"," -%","MC"]
[null,null,1.1000000000000001,"Marine Energy Converter (MEC)",830730.64783096826,830730.64783096826,41536.532391548419,225.86817527482373,8.8190627068813181E-3,5.6963989545223059E-3]
[null,null,"1.1.1","Structural Assembly",108350.80215538191,108350.80215538191,5417.5401077690958,29.459606475695068,1.150255526317881E-3,7.429717414797444E-4,0.5,-0.5,1]
[null,null,"1.1.2","Power Take-Off System (PTO)",596640.56158818188,596640.56158818188,29832.028079409094,162.22119081886726,6.3339549827054172E-3,4.0912209994063767E-3,0.5,-0.5,1]
[null,null,"1.1.3","Mooring, Foundation, and Sub-Structure ",125739.28408740455,125739.28408740455,6286.9642043702279,34.187377980261417,1.3348521978580204E-3,8.6220621363618537E-4,0.5,-0.5,1]
[null,null,1.2,"Balance of System (BOS)",84803049.828303009,84803049.828303009,4240152.4914151505,23057.18486788771,0.9002718463840278,0.83426376680994629]
[null,null,"1.2.1","Project Development",14546076.020928025,14546076.020928025,727303.80104640126,3954.9469576381794,0.15442160091549806,9.9743824853896879E-2,1,-0.5,1]
[null,null,"1.2.2","Engineering and Management",1679093.7348261566,1679093.7348261566,83954.686741307829,456.53045182671633,1.7825311942958999E-2,1.1513705219113156E-2,1,-0.5,1]
[null,null,"1.2.3","Electrical Infrastructure",31716614.427700669,31716614.427700669,1585830.7213850333,8623.4615821439347,0.33670457713121799,0.21748383755754108,1,-0.5,1]
[null,null,"1.2.6","Assembly & Installation",36861265.644848168,36861265.644848168,1843063.2822424085,10022.245876278881,0.39132035639435275,0.25276119958969756,1,-0.5,1]
[null,null,"1.2.6.1","Device",19812750.160153128,19812750.160153128,990637.50800765643,5386.9081844207067,0.21033277936041217,0.13585790965241026,1,-0.5,1]
[null,null,"1.2.6.2","Subsea Cables",17048515.48469504,17048515.48469504,852425.77423475194,4635.3376918581735,0.18098757703394056,0.11690328993728727,1,-0.5,1]
[null,null,1.3,"Financial Costs ",8563378.0476133991,8563378.0476133991,428168.9023806699,2328.3053043162536,9.0909090909090925E-2,5.8719896617477098E-2]
[null,null,"1.3.2","Insurance During Construction",1712675.6095226798,1712675.6095226798,85633.780476133979,465.66106086325073,1.8181818181818184E-2,1.174397932349542E-2,0.5,-0.3,1]
[null,null,"1.3.3","Construction Financing Costs",6850702.4380907193,6850702.4380907193,342535.12190453592,1862.6442434530029,7.2727272727272738E-2,4.6975917293981678E-2,0.5,-0.3,1]
[]
[null,null,"Total CAPEX",null,224424852.04451194,224424852.04451194,4709857.9261873681,25611.358347478788,1,0.89868006238194575]
[]
["OPEX"]
[null,null,null,null,"Cost",null,null,"Economics",null,null,"Uncertainty",null,"Multiplier"]
[null,null,null,null,"$/Farm","$/WEC","$/kW","$/MWh","in %",null," +%"," -%","MC"]
[null,null,2.1,"Operations",2365248.5204451196,2365248.5204451196,53148.579261873681,9186.9964759214909,0.65435904980141935,0.23169619649587053]
[null,null,"2.1.1","Environmental Monitoring",121000,121000,6050,469.98299078411497,3.3475317431367092E-2,1.185297846448894E-2,1,-0.5,1]
[null,null,"2.1.3","Insurance",2244248.5204451196,2244248.5204451196,47098.579261873681,8717.013485137375,0.62088373237005223,0.2198432180313816,1,-0.5,1]
[null,null,2.2000000000000002,"Maintenance",1249354.9929668363,1249354.9929668363,62467.749648341814,4852.690877236535,0.3456409501985806,0.12238494071188136,1,-0.5,1]
[]
[null,null,"Total OPEX",null,3614603.5134119559,3614603.5134119559,115616.3289102155,14039.687353158026,1,0.35408113720775192]
[]
[null,null,"$/MWh",null,null,null,null,39651.045700636816]
[]
[null,null,"Technology LCoE",null,32700462.36900945,32700462.36900945,1569909.2716900902,21510.786026385696,1.276585615545017,0.54250236396767271]
[]
["Tables for Plots"]
[null,null,null,"LCOE Table","%","LCoE",null,null,"CAPEX","%"]
[null,null,null,"Structural Assembly",7.429717414797444E-4,29.459606475695068,null,null,"Structural Assembly",1.150255526317881E-3]
{"$rows_left_out":304}
{"sheet":"MC_Simu","index":5,"n_rows":577,"n_cols":29,"rows_kept":577,"cut":false,"hidden":true,"merged":[]}
["I/O - Screen"]
[]
["WEC Device",null,null,null,null,null,null,null,null,null,null,null,null,null,null,null,null,null,null,null,null,null,null,null,null,null,null,"Lookup 1"]
[null,"Topology",null,null,{"$f":"#REF!","v":{"$error":"#REF!"}},null,null,null,null,null,null,null,null,null,null,null,null,null,null,null,null,null,null,null,null,null,null,null,"One Body"]
[null,"Device Selection",null,null,{"$f":"#REF!","v":{"$error":"#REF!"}},null,null,null,null,null,null,null,null,null,null,null,null,null,null,null,null,null,null,null,null,null,null,null,"Two Body"]
[null,"Absorber Buoy Diameter",null,null,{"$f":"#REF!","v":{"$error":"#REF!"}},"m"]
[null,"Absorber Buoy Height",null,null,{"$f":"#REF!","v":{"$error":"#REF!"}},"m"]
[null,"Absorber Volume",null,null,{"$f":"(E6/2)^2*PI()*E7","v":{"$error":"#REF!"}},"m^3"]
[null,"Steel Weight",null,null,{"$f":"#REF!","v":{"$error":"#REF!"}},"mT"]
[null,"Reaction Mass",null,null,{"$f":"#REF!","v":{"$error":"#REF!"}},"mT",null,null,null,null,null,null,null,null,null,null,null,null,null,null,null,null,null,null,null,null,null,"Lookup 2"]
[null,"Reaction Tube Length",null,null,{"$f":"#REF!","v":{"$error":"#REF!"}},"m",null,null,null,null,null,null,null,null,null,null,null,null,null,null,null,null,null,null,null,null,null,null,"Oregon"]
[null,"Rho",null,null,1025,"kg/m^3",null,null,null,null,null,null,null,null,null,null,null,null,null,null,null,null,null,null,null,null,null,null,"California"]
[null,"Reaction Tube Volume",null,null,{"$f":"E10*1000/E12","v":{"$error":"#REF!"}},"m^3",null,null,null,null,null,null,null,null,null,null,null,null,null,null,null,null,null,null,null,null,null,null,"Cape Cod"]
[null,"Reaction Tube Diameter",null,null,{"$f":"SQRT(E13/E11/PI())*2","v":{"$error":"#REF!"}},"m"]
[null,"Water Depth",null,null,{"$f":"#REF!","v":{"$error":"#REF!"}},"m"]
[]
["WEC Farm"]
[null,"Wave Resource",null,null,{"$f":"#REF!","v":{"$error":"#REF!"}}]
[null,"Power Export",null,null,{"$f":"#REF!","v":{"$error":"#REF!"}},null,null,null,null,null,null,null,null,null,null,null,null,null,null,null,null,null,null,null,null,null,null,"Lookup 3"]
[null,"Distance to Shore",null,null,{"$f":"#REF!","v":{"$error":"#REF!"}},"m",null,null,null,null,null,null,null,null,null,null,null,null,null,null,null,null,null,null,null,null,null,null,"Blue Economy"]
[null,"# of WECs",null,null,{"$f":"#REF!","v":{"$error":"#REF!"}},null,null,null,null,null,null,null,null,null,null,null,null,null,null,null,null,null,null,null,null,null,null,null,"Grid Connected"]
[]
["Economics"]
[null,"Fixed Charge Rate",null,null,{"$f":"#REF!","v":{"$error":"#REF!"}}]
[null,"Construction Financing Rate",null,null,{"$f":"#REF!","v":{"$error":"#REF!"}}]
[null,"Insurance Rate (annual percent of Capex)",null,null,{"$f":"#REF!","v":{"$error":"#REF!"}}]
[null,"O&M as percentage of CAPEX",null,null,{"$f":"#REF!","v":{"$error":"#REF!"}}]
[null,null,null,null,null,null,null,null,null,null,"Plant Scale Target",null,{"$f":"#REF!","v":{"$error":"#REF!"}},"MW"]
["Performance",null,null,null,"Per Unit",null,"Farm",null,null,null,"# Units",null,{"$f":"M28*1000/E31","v":{"$error":"#REF!"}}]
[null,"Compute Upper Theretical Limit",null,null,{"$f":"#REF!","v":{"$error":"#REF!"}}]
[null,"Rated Power",null,null,{"$f":"#REF!","v":{"$error":"#REF!"}},"kW",{"$f":"E31*E21","v":{"$error":"#REF!"}},"kW"]
[null,"PTO Efficiency",null,null,{"$f":"#REF!","v":{"$error":"#REF!"}},null,{"$f":"E32","v":{"$error":"#REF!"}}]
[null,"Availability",null,null,{"$f":"#REF!","v":{"$error":"#REF!"}},null,{"$f":"E33","v":{"$error":"#REF!"}}]
[null,"Transmission Efficiency",null,null,{"$f":"#REF!","v":{"$error":"#REF!"}},null,{"$f":"E34","v":{"$error":"#REF!"}}]
[null,"Average Mechanical Power",null,null,{"$f":"IF(E30=1,#REF!,#REF!)","v":{"$error":"#REF!"}}]
[null,"Average Electric Power",null,null,{"$f":"IF(E30=1,#REF!,#REF!)","v":{"$error":"#REF!"}}]
[null,"Annual Electrical Energy Output",null,null,{"$f":"IF(E30=1,#REF!,#REF!)","v":{"$error":"#REF!"}},"MWh",{"$f":"E37*E21","v":{"$error":"#REF!"}},"MWh"]
[null,"Equivalent # US Households",null,null,{"$f":"IF(E30=1,#REF!,#REF!)","v":{"$error":"#REF!"}}]
[null,"Capacity Factor",null,null,{"$f":"IF(E30=1,#REF!,#REF!)","v":{"$error":"#REF!"}},null,{"$f":"E39","v":{"$error":"#REF!"}},null,null,null,"CF Target",{"$f":"#REF!","v":{"$error":"#REF!"}}]
[null,"P/V",null,null,{"$f":"IF(E30=1,#REF!,#REF!)","v":{"$error":"#REF!"}},"kW/m^3",{"$f":"E40","v":{"$error":"#REF!"}}]
{"$rows_left_out":537}